Находки в опенсорсе: Python
1.06K subscribers
5 photos
348 links
Легкие задачки в опенсорсе из мира Python

Чат: @opensource_findings_chat
Download Telegram
🚀 New issue to wemake-services/django-modern-rest by @sobolevn
📝 Test `Valkey` support (#980)


Currently we only test redis as the database for SyncRedis and AsyncRedis throttling backends. We also need to test Valkey, because we claim to support it.


#good_first_issue #help_wanted #ci #django_modern_rest
sent via relator
🚀 New issue to wemake-services/django-modern-rest by @sobolevn
📝 Flaky test: `test_redis_async_leaky_bucket` (#1204)


Using --randomly-seed=706466424: https://github.com/wemake-services/django-modern-rest/actions/runs/30856534508/job/91828743292#step:9:3033

=========================== short test summary info ============================
FAILED tests/test_integration/test_throttling/test_backends/test_redis_backend/test_redis_backend.py::test_redis_async_leaky_bucket[True] - assert 200 == <HTTPStatus.TOO_MANY_REQUESTS: 429>
+ where 200 = <HttpResponse status_code=200, "application/json">.status_code
+ and <HTTPStatus.TOO_MANY_REQUESTS: 429> = HTTPStatus.TOO_MANY_REQUESTS
============ 1 failed, 2787 passed, 14 skipped in 231.98s (0:03:51) ============

We need to investigate why it failed and fix / refactor it.


#bug #help_wanted #ci #django_modern_rest
sent via relator
🚀 New issue to wemake-services/django-modern-rest by @sobolevn
📝 Remove `tomli` from`additional_dependencies` in pre-commit (#1255)


We don't need it, since we run py3.11+ with tomllib:

django-modern-rest/.pre-commit-config.yaml

Lines 61 to 62 in d1f2b6c


#good_first_issue #help_wanted #ci #django_modern_rest
sent via relator
🚀 New issue to wemake-services/django-modern-rest by @sobolevn
📝 `test_custom_union_format` failed in CI (#1533)


Seed for the repro: --randomly-seed=1177358910

FAILED tests/test_unit/test_plugins/test_pydantic/test_pydantic_schema.py::test_custom_union_format[PydanticSerializer] - AssertionError: assert Schema(all_of...ne, defs=None) == Schema(all_of...ne, defs=None)

Omitting 58 identical items, use -vv to show
Differing attributes:
['type']

Drill down into differing attribute type:
type: [<OpenAPIType.STRING: 'string'>, <OpenAPIType.INTEGER: 'integer'>] != [<OpenAPIType.INTEGER: 'integer'>, <OpenAPIType.STRING: 'string'>]
At index 0 diff: <OpenAPIType.STRING: 'string'> != <OpenAPIType.INTEGER: 'integer'>

Full diff:
[
+ <OpenAPIType.STRING: 'string'>,
<OpenAPIType.INTEGER: 'integer'>,
- <OpenAPIType.STRING: 'string'>,
]
FAILED tests/test_unit/test_plugins/test_pydantic/test_pydantic_schema.py::test_custom_union_format[PydanticFastSerializer] - AssertionError: assert Schema(all_of...ne, defs=None) == Schema(all_of...ne, defs=None)

Omitting 58 identical items, use -vv to show
Differing attributes:
['type']

Drill down into differing attribute type:
type: [<OpenAPIType.STRING: 'string'>, <OpenAPIType.INTEGER: 'integer'>] != [<OpenAPIType.INTEGER: 'integer'>, <OpenAPIType.STRING: 'string'>]
At index 0 diff: <OpenAPIType.STRING: 'string'> != <OpenAPIType.INTEGER: 'integer'>

Full diff:
[
+ <OpenAPIType.STRING: 'string'>,
<OpenAPIType.INTEGER: 'integer'>,
- <OpenAPIType.STRING: 'string'>,
]

https://github.com/wemake-services/django-modern-rest/actions/runs/34912494319/job/104202853421?pr=1510


#bug #help_wanted #ci #opensource_september #django_modern_rest
sent via relator